COLOSTATE/CIRA
change note: 2021-04-26 13:44:50.0 [tstevens] insert AltLabel (id: null category: primary text: COLOSTATE/CIRA > Cooperative Institute for Research in the Atmosphere, Colorado State University language code: en); insert Definition (id: null text: The Cooperative Institute for Research in the Atmosphere (CIRA) serves as a nexus for multi-disciplinary cooperation between NOAA research scientists and Colorado State University research staff, faculty, and students, aligning NOAA-identified research theme areas with long-standing academic strengths of the University. Our mission is: to foster additional collaboration with national and international agencies who are developing related capabilities; to affect the fundamental research conducted at the University towards NOAA’s operational needs; and to communicate our research and its practical implications to the scientific community and the public. To this end, we are dedicated to: providing high-quality training to ensure operational user proficiency; conducting outreach programs to K-12 education and the general public to promote environmental literacy; and to quantifying and communicating the significant positive societal impacts of NOAA research on our everyday lives. language code: en); insert Resource (id: null type: provider url: https://www.cira.colostate.edu/);
change note: 2021-04-26 13:41:33.0 [tstevens] Insert Concept add broader relation (COLOSTATE/CIRA [8277fb20-9f7c-4364-9b30-57b1851146e4,578424] - ACADEMIC [7700280b-68ee-4644-bf5e-84e7a6adf897,561669]);
in scheme: providers
definition: The Cooperative Institute for Research in the Atmosphere (CIRA) serves as a nexus for multi-disciplinary cooperation between NOAA research scientists and Colorado State University research staff, faculty, and students, aligning NOAA-identified research theme areas with long-standing academic strengths of the University. Our mission is: to foster additional collaboration with national and international agencies who are developing related capabilities; to affect the fundamental research conducted at the University towards NOAA’s operational needs; and to communicate our research and its practical implications to the scientific community and the public. To this end, we are dedicated to: providing high-quality training to ensure operational user proficiency; conducting outreach programs to K-12 education and the general public to promote environmental literacy; and to quantifying and communicating the significant positive societal impacts of NOAA research on our everyday lives.
type: Concept

ACADEMIC
type: Concept