SOCIAL BEHAVIOR
type: Concept

HAZARD MITIGATION/PLANNING
change note: 2012-06-29 12:13:45.0 [tbs1979] insert Definition (id: null text: A cost-effective measure that will reduce the potential for damage to a facility or area from a disaster event. Pre-planning for a hazard can reduce or eliminate the long-term risk to human life and property from hazards. language code: en);
change note: 2012-06-26 14:47:34.0 [tbs1979] Insert Concept add broader relation (HAZARD MITIGATION/PLANNING [843a6584-e3f2-4a75-a003-cc430fd8c22c,40011] - SOCIAL BEHAVIOR [c8317644-4cb2-4e37-b536-c762f7e670ab,20567]);
in scheme: sciencekeywords
definition: A cost-effective measure that will reduce the potential for damage to a facility or area from a disaster event. Pre-planning for a hazard can reduce or eliminate the long-term risk to human life and property from hazards.
type: Concept