ACADEMIC
type: Concept

GU/MARECOL
in scheme: providers
definition: The Department of Biological and Environmental Sciences teaching and research activities stretch from the alpine ecosystem, through forests, cultivated land and streams, all the way into the marine environment. In these environments we study different levels of biological organization from genes, individuals and populations, to communities and ecosystems. We work within ecology, evolution, physiology, systematics and combinations of these fields in order to understand the impact of natural and anthropogenic changes of the environment.
type: Concept