FORMAT CONVERSION SERVICES
in scheme: sciencekeywords
definition: Service that converts data from one format to another, including data compression and decompression.
type: Concept

DATA PROCESSING SERVICES
type: Concept