LIDAR
type: Concept

LIDAR WAVEFORM
change note: 2020-04-02 09:56:11.0 [sritz] Insert Concept add broader relation (LIDAR WAVEFORM [85fa8e79-82c0-4f18-bf12-d6e7bc8c76b0,559895] - LIDAR [6182be8b-d006-4327-994d-6f27c7e4d9a9,84289]);
in scheme: sciencekeywords
definition: LIDAR (Light Detection and Ranging) is an optical remote sensing technology that measures properties of scattered light to find range and/or other information of a distant target. A Full Waveform LiDAR System records the entire emitted and backscattered signal of each laser pulse. Full waveform LiDAR data are more complex to process however they can often capture more information compared to discrete return LiDAR systems.
type: Concept