CONSORTIA/INSTITUTIONS
type: Concept

PANGAEA/CRP
in scheme: providers
definition: The Cape Roberts Project was a collaborative effort among the Antarctic programs of the United States, New Zealand, Italy, Germany, Australia and the United Kingdom to collect a series of cores for the purposes of investigating Antarctic tectonic and climatic history. Drilling was performed using a drilling rig located on fast ice in McMurdo Sound. Website: "http://www.pangaea.de/Projects/CRP/"
type: Concept