DOD/USNAVY/NAVOCEANO
change note: 2013-05-23 16:23:30.0 [mpmorahan] insert AltLabel (id: null text: Naval Oceanographic Office language code: en);
change note: 2013-05-23 16:10:42.0 [mpmorahan] Insert Concept add broader relation (DOD/USNAVY/NAVOCEANO [86b91e8f-c74b-499a-b9dc-6fd0f48fdde2,105157] - DOD [9a3a209f-1d22-4a48-bbb2-dbfbca2959b1,66699]);
change note: 2013-05-23 17:57:30.0 [mpmorahan] update AltLabel (Naval Oceanographic Office, U.S. Navy, U.S. Department of Defense);
definition: The Naval Oceanographic Office (NAVOCEANO), the largest subordinate command within the Naval Meteorology and Oceanography Command, is responsible for providing oceanographic products and services to all elements of the Department of Defense. NAVOCEANO is located at John C. Stennis Space Center in south Mississippi. From data collection through production and analysis, NAVOCEANO provides the warfighter the best available knowledge of the maritime battlespace. This includes tailored oceanographic, hydrographic, bathymetric, geophysical and acoustic products and services that aid in safe navigation and effective mission planning. - Commanding Officer, Captain Paul Oosterling
type: Concept
in scheme: providers

DOD
type: Concept