Probes
type: Concept

SOIL MOISTURE PROBE
change note: 2021-08-05 17:15:20.0 [sritz] insert AltLabel (id: null category: primary text: SOIL MOISTURE PROBE language code: en);
in scheme: instruments
definition: A SOIL MOISTURE PROBE is a device that measures the total amount of water, including the water vapor, in unsaturated soil.
type: Concept