FLUVIAL LANDFORMS
type: Concept

POND
change note: 2013-08-15 13:07:56.0 [tbs1979] insert Definition (id: null text: A body of standing water, either natural or man-made, that is usually smaller than a lake. They may arise naturally in floodplains as part of a river system, or they may be somewhat isolated depressions (examples include vernal pools and prairie potholes). language code: en);
change note: 2013-08-05 12:37:30.0 [tbs1979] Insert Concept add broader relation (POND [89228e69-5a64-4662-839f-cb3d2209fa41,105329] - FLUVIAL LANDFORMS [bdc0bd86-a3a3-48fa-b1fb-4ca5d13d4dde,105281]);
in scheme: sciencekeywords
definition: A body of standing water, either natural or man-made, that is usually smaller than a lake. They may arise naturally in floodplains as part of a river system, or they may be somewhat isolated depressions (examples include vernal pools and prairie potholes).
type: Concept