Spectrometers/Radiometers
type: Concept

CIT-ToF-CIMS
change note: 2020-04-14 14:09:48.0 [tstevens] insert AltLabel (id: null category: primary text: Chemical Ionization Time-of-Flight Mass Spectrometer language code: en); insert Definition (id: null text: The Aerodyne ToF-CIMS combines chemical ionization with high-resolution time-of-flight mass spectrometry for sensitive, real-time identification and quantification of gas-phase compounds in sampled air. language code: en);
change note: 2020-04-14 14:08:47.0 [tstevens] Insert Concept add broader relation (CIT-ToF-CIMS [8936f1d7-6fee-4a67-8c64-661eb8c836e1,559925] - Spectrometers/Radiometers [ecd58f82-8f96-45e1-9547-dd4a02291bd9,546159]);
in scheme: instruments
definition: The Aerodyne ToF-CIMS combines chemical ionization with high-resolution time-of-flight mass spectrometry for sensitive, real-time identification and quantification of gas-phase compounds in sampled air.
type: Concept