UMICH/NAME
in scheme: providers
definition: The Department of Naval Architecture and Marine Engineering offers study in the exciting field of engineering for the marine environment and will help prepare the individual for a career in many aspects of the field. This includes engineering related to the design and production of all kinds of vehicles, structures, and systems to operate successfully in the harsh and demanding marine environment. Research areas: Experimental Hydrodynamics Acoustics and Vibration Analytical Marine Hydrodynamics Nonlinear Dynamics Offshore Mechanics Marine Engineering Coastal Processes Concurrent Marine Design Remote Sensing Virtual Reality and Scientific Visualization Structural Mechanics Marine Systems Management Website: http://www.engin.umich.edu/dept/name/name.html [Summary provided by the University of Michigan.]
type: Concept

ACADEMIC
type: Concept