UHI/SOEST/OCEAN/LMO
change note: 2022-07-08 17:10:55.0 [sritz] update Resource (provider); update Resource (https://hahana.soest.hawaii.edu/);
in scheme: providers
definition: The Laboratory for Microbial Oceanography is a research unit within the recently created School of Ocean and Earth Science and Technology at the University of Hawaii at Manoa. Professor David M. Karl currently serves as unit Head and co-ordinates all activities in the Laboratory. He also holds an appointment in the Department of Oceanography where he performs his academic duties including teaching and graduate student advising and an appointment in the SOEST Division of Oceanic Biology where he currently serves in the capacity of research oceanographer. Professor Karl has recently been appointed an Affiliate Faculty member of the Bermuda Biological Station for Research, Inc. Website: http://hahana.soest.hawaii.edu/ [Summary provided by the University of Hawaii.]
type: Concept

ACADEMIC
type: Concept