ModelE
type: Concept
definition: The current incarnation of the GISS series of coupled atmosphere-ocean models is available here. Called ModelE, it provides the ability to simulate many different configurations of Earth System Models — including interactive atmospheric chemistry, aerosols, carbon cycle and other tracers, as well as the standard atmosphere, ocean, sea ice and land surface components.
in scheme: platforms
change note: 2018-08-09 13:44:40.0 [sritz] insert AltLabel (id: null category: primary text: GISS GCM ModelE language code: en); insert Definition (id: null text: The current incarnation of the GISS series of coupled atmosphere-ocean models is available here. Called ModelE, it provides the ability to simulate many different configurations of Earth System Models — including interactive atmospheric chemistry, aerosols, carbon cycle and other tracers, as well as the standard atmosphere, ocean, sea ice and land surface components. language code: en);
change note: 2018-08-09 13:50:02.0 [sritz] update PrefLabel (ModelE);
change note: 2018-08-09 13:43:43.0 [sritz] Insert Concept add broader relation (MODELE [8ad656db-1324-4e92-8273-5a765ca29282,368043] - Models/Analyses [113ecbc2-ab36-4d58-a96c-a6ce0106e749,344529]);
change note: 2021-11-30 13:30:43.0 [tstevens] Move Concepts delete broader relation (null); add broader relation (ModelE [8ad656db-1324-4e92-8273-5a765ca29282,826481] - Models [0a184cdc-c074-4946-90a6-02f03c686341,835911]);

Models
type: Concept