DEBRIS THICKNESS
change note: 2020-12-22 15:57:30.0 [sritz] Insert Concept add broader relation (DEBRIS THICKNESS [8b705c00-50a7-438f-8fdd-c5799f7dab89,560804] - GLACIERS [68eed887-8008-4352-b420-949457ab59ab,84413]);
in scheme: sciencekeywords
definition: Thickness of unconsolidated sediment of boulder (clast) fragments, predominantly originating from physical weathering.
type: Concept

GLACIERS
type: Concept