COASTAL PROCESSES
type: Concept

DEPOSITION
change note: 2013-08-20 09:58:08.0 [tbs1979] insert Definition (id: null text: The act of depositing material, especially by a natural process; the resultant deposit. language code: en);
change note: 2013-08-06 08:36:29.0 [tbs1979] Insert Concept add broader relation (DEPOSITION [8b99d6c3-1751-43e6-81d1-92a7618cadb3,105563] - COASTAL PROCESSES [e26803a0-82ea-40c4-a41a-9e222c9bd09a,86507]);
in scheme: sciencekeywords
definition: The act of depositing material, especially by a natural process; the resultant deposit.
type: Concept