EP
in scheme: providers
definition: The EcoPort 'universe' may be presented as four distinct but integrated conceptual domains within, and across which a variety of tools and procedures apply in a more or less standard manner. These domains deal with Resources, Entities, EthoGraphs and eNarratives. Resources available for your use are listed in the lower left-hand frame. Clicking on an ... item in this frame leads to either a list from which you can make your choices or a search form to enable you to find what you are looking for. In all cases, please consult the Help and Information icons that appear on these pages. Ecoport is a service that Ecoport runs under the auspices of the University of Florida, the Food and Agriculture Organization of the United Nations and National Museum of Natural History of the Smithsonian Institution. Literature: refers you to a variety of tools and procedures to find and manage references, bibliographies, lists and annotated bibliographies. Glossary of Terms: gives you access to several categories of terms and their descriptions which may be hyperlinked to other terms and information in other sections of EcoPort. Hypermemes: refer to several categories of discrete blocks of information called memes. Examples include standard methods and recipes that are recorded once as HyperMeme records so that they can be used many times from other points within EcoPort. Picture Databank: contains pictures shared by members of the EcoPort community. EcoPort users agree to allow other Editors and Authors to make use of the pictures stored in the communal picture database. Such use is allowed for non-commercial and educational purposes only and submitting authors retain all intellectual property rights associated with original authorship. Slide Shows: are assemblies of slides to which a Slide Show author attaches a caption so that the set of pictures and text constitutes a film strip or slide show that can be viewed on the Internet or a stand-alone EcoPort CD-ROM. In assembling Slide Sh…
type: Concept

CONSORTIA/INSTITUTIONS
type: Concept