ICE STUPA
change note: 2020-05-08 08:30:38.0 [tstevens] Insert Concept add broader relation (ICE STUPA [8c425053-be1d-4dbe-b5e9-b9e85e382940,560065] - GLACIERS [4a426aab-4a95-4bf4-8449-19a72a251541,85205]);
in scheme: sciencekeywords
definition: Ice Stupa is a form of glacier grafting technique that creates artificial glaciers, used for storing winter water (which otherwise would go unused) in the form of conical shaped ice heaps. During summer, when water is scarce, the Ice Stupa melts to increase water supply for crops.
type: Concept

GLACIERS
type: Concept