NASA
type: Concept

ORNL_DAAC
change note: 2017-06-12 14:16:33.0 [sritz] update Definition (The Oak Ridge National Laboratory (ORNL) Distributed Active Archive Center (DAAC) for Biogeochemical Dynamics is operated by the ORNL Environmental Sciences Division (ESD) as part of the National Aeronautics and Space Administration's (NASA) Earth Science Enterprise (ESE) program. The ORNL DAAC archives data and model products related to biogeochemical dynamics which are the result of the interactions between the biological, geological, and chemical components of the Earth's environment. As components of the Earth Observing System (EOS) Data Information System (EOSDIS), DAACs generate EOS standard data products and carry out NASA's responsibilities for data archival, distribution, and management. Many of these sites also carry related data products that pre-date EOS. DAACs and affiliated data centers have home pages and FTP sites for transfer of information and data. ORNL DAAC User Services Office P.O. Box 2008, MS 6407 Oak Ridge National Laboratory Oak Ridge, Tn 37831-6407 Phone: 1-865-241-3952 Email: uso@daac.ornl.gov https://daac.ornl.gov/); update Definition (https://daac.ornl.gov/);
in scheme: providers
definition: The Oak Ridge National Laboratory (ORNL) Distributed Active Archive Center (DAAC) for Biogeochemical Dynamics is operated by the ORNL Environmental Sciences Division (ESD) as part of the National Aeronautics and Space Administration's (NASA) Earth Science Enterprise (ESE) program. The ORNL DAAC archives data and model products related to biogeochemical dynamics which are the result of the interactions between the biological, geological, and chemical components of the Earth's environment. As components of the Earth Observing System (EOS) Data Information System (EOSDIS), DAACs generate EOS standard data products and carry out NASA's responsibilities for data archival, distribution, and management. Many of these sites also carry related data products that pre-date EOS. DAACs and affiliated data centers have home pages and FTP sites for transfer of information and data. ORNL DAAC User Services Office P.O. Box 2008, MS 6407 Oak Ridge National Laboratory Oak Ridge, Tn 37831-6407 Phone: 1-865-241-3952 Email: uso@daac.ornl.gov https://daac.ornl.gov/
type: Concept