IONOSPHERE/MAGNETOSPHERE DYNAMICS
type: Concept

MAGNETIC FIELDS/MAGNETIC CURRENTS
in scheme: sciencekeywords
definition: An Electromagnetic field (EM field) is the region of space near electric currents, magnets, broadcasting antennas etc., regions in which electric and magnetic forces may act, for example on charged particles.
type: Concept