ANIMALS/INVERTEBRATES
type: Concept

FLATWORMS/FLUKES/TAPEWORMS
in scheme: sciencekeywords
definition: Flatworms have a dorsoventrally flattened, simple triploblastic body lacking a coelom, anus and blood vascular system.
type: Concept