RSP-2
change note: 2019-10-09 11:27:02.0 [sritz] insert AltLabel (id: null category: primary text: Research Scanning Polarimeter - 2 language code: en); insert Definition (id: null text: n order to demonstrate the capabilities of polarimetry an instrument that can make either ground-based, or aircraft measurements, the Research Scanning Polarimeter (RSP) has been developed by SpecTIR Corporation. This instrument has similar functional capabilities to the proposed EOSP satellite instrument. Additional Information: https://airbornescience.nasa.gov/instrument/RSP language code: en);
change note: 2019-10-09 11:26:02.0 [sritz] Insert Concept add broader relation (RSP-2 [8d33aeea-d885-4a45-89da-1dd407cbed05,369425] - Photon/Optical Detectors [8143e95e-a438-4a2a-82b2-6d7ae079fba7,347785]);
in scheme: instruments
definition: n order to demonstrate the capabilities of polarimetry an instrument that can make either ground-based, or aircraft measurements, the Research Scanning Polarimeter (RSP) has been developed by SpecTIR Corporation. This instrument has similar functional capabilities to the proposed EOSP satellite instrument. Additional Information: https://airbornescience.nasa.gov/instrument/RSP
type: Concept

Photon/Optical Detectors
type: Concept