USDA
type: Concept

USDA/NRCS/WSR
in scheme: providers
definition: The USDA World Soil Resources collaborates with national institutions to help manage and conserve their natural resources, improve their abilities to attain sustainable agriculture, and enhance their capabilities to address problems of food security, income generation, and the environment. Website: "http://soils.usda.gov/use/worldsoils/" [Summary provided by the USDA.]
type: Concept