Current/Wind Meters
type: Concept

RM Young 05103 Wind Monitor
change note: 2021-08-10 08:43:34.0 [tstevens] insert AltLabel (id: null category: primary text: RM Young Model 05103 Wind Monitor language code: en); insert Definition (id: null text: The wind speed sensor is a four blade helicoid propeller. Propeller rotation produces an AC sine wave voltage signal with frequency directly proportional to wind speed. Slip rings and brushes are eliminated for increased reliability. language code: en);
change note: 2021-08-10 08:41:54.0 [tstevens] Insert Concept add broader relation (RM Young 05103 Wind Monitor [8d850e78-621b-4dfe-bb4d-f1e8338921a3,706569] - Current/Wind Meters [1b41692e-c7fe-4567-bed9-b938a7400462,697939]);
in scheme: instruments
definition: The wind speed sensor is a four blade helicoid propeller. Propeller rotation produces an AC sine wave voltage signal with frequency directly proportional to wind speed. Slip rings and brushes are eliminated for increased reliability.
type: Concept