ACADEMIC
type: Concept

TUAT/FA/PF
in scheme: providers
definition: Unlike any other university in Japan, Tokyo University of Agriculture and Technology (TUAT) is a unique institution that focuses on education and research in the academic fields that support agriculture and engineering, the core of the industrial base. The university has a long history that extends back more than 130 years to its inception. Summary Provided By: http://www.tuat.ac.jp/english/about/message.html
type: Concept