SILVICULTURE
change note: 2019-09-17 09:06:18.0 [tstevens] Insert Concept add broader relation (SILVICULTURE [8e115d45-acd4-4116-a0e1-3de8a5db23c2,369187] - FOREST SCIENCE [22ec2f9b-1f1a-469b-bc09-851d58637ff4,84151]);
in scheme: sciencekeywords
definition: Silviculture is the art and science of controlling the establishment, growth, composition, health, and quality of forests and woodlands to meet the diverse needs and values of landowners and society such as wildlife habitat, timber, water resources, restoration, and recreation on a sustainable basis. This is accomplished by applying different types of silvicultural treatments such as thinning, harvesting, planting, pruning, prescribed burning and site preparation. Intermediate treatments (thinning) are designed to enhance growth, quality, vigor, and composition of the stand after establishment or regeneration and prior to final harvest. Regeneration treatments (harvesting) are applied to mature stands in order to establish a new age class of trees. Regeneration methods are grouped into four categories: coppice, even-aged, two-aged, and uneven-aged. All vegetation activities, including prescribed fire, wildlife habitat improvement, timber harvesting and cutting trees in campgrounds for human safety must have a silvicultural prescription. A silvicultural prescription is a document which has a planned series of treatments designed to change current stand structure and composition of a stand to one that meets management goals. The prescription normally considers ecological, economic, and societal objectives and constraints. In the Forest Service, silvicultural prescriptions are prepared or reviewed by a certified silviculturist prior to implementing the project or treatment.
type: Concept

FOREST SCIENCE
type: Concept