ARP
in scheme: instruments
definition: The Acoustic Recording Package (ARP) is a passive, continuous acoustic recorder that drops to the bottom of the ocean and records low frequency noises. It can record baleen whale calls within an area of up to 50 km around the device. [Source: NOAA]
type: Concept

Acoustic Sounders
type: Concept