POLDER-2
change note: 2014-02-26 12:38:44.0 [mpmorahan] insert AltLabel (id: null text: Polarization/Directionality of the Earth's Reflectance-2 language code: en);
change note: 2014-02-26 12:35:15.0 [mpmorahan] Insert Concept add broader relation (POLDER-2 [8f95953c-8c1b-44b1-8ca5-d1322e34e70d,106177] - Imaging Spectrometers/Radiometers [944b7691-af37-4fb4-9393-c114e7997829,74845]);
in scheme: instruments
definition: The POLDER instrument is a camera composed of a two-dimensional CCD detector array, wide field of view telecentric optics and a rotating wheel carrying spectral and polarized filters.[https://polder-mission.cnes.fr/en/POLDER/GP_instrument.htm] Group: Instrument_Details Entry_ID: POLDER-2 Group: Instrument_Identification Instrument_Category: Earth Remote Sensing Instruments Instrument_Class: Passive Remote Sensing Instrument_Type: Spectrometers/Radiometers Instrument_Subtype: Imaging Spectrometers/Radiometers Short_Name: POLDER-2 Long_Name: Polarization/Directionality of the Earth's Reflectance-2 End_Group Group: Associated_Platforms Short_Name: ADEOS-II End_Group Group: Spectral_Frequency_Information Wavelength_Keyword: Near Infrared End_Group Group: Spectral_Frequency_Information Wavelength_Keyword: Visible End_Group Online_Resource: https://polder-mission.cnes.fr/en/POLDER/GP_instrument.htm Sample_Image: http://smsc.cnes.fr/IcPOLDER/B07A.jpg Creation_Date: 2014-02-27 Group: Instrument_Logistics Data_Rate: 882 kbps Instrument_Owner: CNES End_Group End_Group
type: Concept

Imaging Spectrometers/Radiometers
type: Concept