DESTRUCTION POTENTIAL INDEX
alternative label: DPI
definition: Destruction Potential Index (DPI), is a measure of the potential for damage and casualties with a particular outbreak.
in scheme: sciencekeywords
change note: 2016-06-28 13:53:54.0 [saritz] insert AltLabel (id: null text: DPI language code: en);
change note: 2016-06-28 13:53:35.0 [saritz] update Definition (Destruction Potential Index (DPI), is a measure of the potential for damage and casualties with a particular outbreak.);
change note: 2016-06-28 13:52:13.0 [saritz] Insert Concept add broader relation (DESTRUCTION POTENTIAL INDEX [8fd6e7bc-df59-4637-b1e7-d6715fb3e8af,217713] - TORNADOES [a200e677-384a-42d6-8519-1c7735f0adb9,84177]);
change note: 2016-06-28 13:53:14.0 [saritz] insert Definition (id: null text: Destruction Potential Index (DPI), is a measure of the potential for damage and casualties with a particular outbreak: language code: en);
type: Concept

TORNADOES
type: Concept