BIOGEOCHEMICAL CYCLES
in scheme: sciencekeywords
definition: A Biogeochemical cycle is the movement of chemical elements from organism to physical environment to organism in more or less circular pathways.
type: Concept

ECOSYSTEM FUNCTIONS
type: Concept