CARBON AND HYDROCARBON COMPOUNDS
type: Concept

ISOPRENE
change note: 2021-04-27 12:07:20.0 [tstevens] insert Definition (id: null text: Isoprene is an unsaturated pentahydrocarbon, Isoprene is found in certain plants or obtained by distillation of caoutchouc or gutta-percha. In plants, it is elementary in the formation of isoprenoids, fat-soluble vitamins, carotenoids and related pigments. Isoprenes contribute to flavors and fragrances of essential oils and other plant-derived substances. language code: en);
change note: 2021-04-26 12:35:41.0 [tstevens] Insert Concept add broader relation (ISOPRENE [9154777e-2e33-49b5-a21e-0a2638c57528,578422] - CARBON AND HYDROCARBON COMPOUNDS [19ab681c-bdd7-4793-bbdb-1ec498575314,575305]);
in scheme: sciencekeywords
definition: Isoprene is an unsaturated pentahydrocarbon, Isoprene is found in certain plants or obtained by distillation of caoutchouc or gutta-percha. In plants, it is elementary in the formation of isoprenoids, fat-soluble vitamins, carotenoids and related pigments. Isoprenes contribute to flavors and fragrances of essential oils and other plant-derived substances.
type: Concept