NON-GOVERNMENT/NON-PROFIT ORGANIZATIONS
type: Concept

ER
in scheme: providers
definition: EarthRef is a website for Earth Science reference data and models. Users can search data and models from four (4) databases: Geochemical Earth Reference Model (GERM), Magnetics Information Consortium (MagIC), Seamount Biogeosciences nETWORK (SBN), and Enduring Resources for Earth Science Education (ERESE).
type: Concept