DIELECTRIC PROBE
change note: 2021-08-05 11:24:12.0 [sritz] insert AltLabel (id: null category: primary text: DIELECTRIC PROBE language code: en);
in scheme: instruments
definition: A DIELECTRIC PROBE is designed device that is an electrical insulator, a device that has material with a low electrical conductivity; determines other conductivities of other materials; dielectric = insulator.
type: Concept

Probes
type: Concept