SDO
type: Concept

Solar/Space Observation Satellites
type: Concept

Living with a Star
change note: 2021-07-22 17:01:16.0 [sritz] insert Definition (id: null text: The LWS Program provides missions to improve our understanding of how and why the Sun varies, how the Earth and Solar System respond, and how the variability and response affects humanity in Space and on Earth. language code: en);
in scheme: platforms
definition: The LWS Program provides missions to improve our understanding of how and why the Sun varies, how the Earth and Solar System respond, and how the variability and response affects humanity in Space and on Earth.
type: Concept