UC-SC/BSOE/MATH-STAT
in scheme: providers
definition: The mission of the Department of Applied Mathematics and Statistics is to promote the sound use of theories, methods, and applications in applied mathematics (AM) and statistics (S) on the campus of the University of California, Santa Cruz, and provide service to the campus, the surrounding community, the state of California, and the professions of applied mathematics and statistics, through excellence in research and teaching. Website: http://www.ams.ucsc.edu/ [Summary provided by the University of California.]
type: Concept

ACADEMIC
type: Concept