Space Station
type: Concept

ISS
change note: 2021-12-01 13:30:26.0 [tstevens] Move Concepts delete broader relation (null); add broader relation (ISS [93c5d18c-be62-46c4-9545-42f73a854d85,826516] - Space Station [a4297e6c-efe4-4194-8309-0b8bd658445b,835934]);
change note: 2021-08-17 17:40:30.0 [sritz] delete Resource (null);
change note: 2016-06-09 14:44:37.0 [epneff] added altLabel insert AltLabel (id: null text: INTERNATIONAL SPACE STATION (ISS) language code: en);
change note: 2021-11-30 12:15:18.0 [tstevens] Move Concepts delete broader relation (null); add broader relation (ISS [93c5d18c-be62-46c4-9545-42f73a854d85,826516] - Space Stations/Crewed Spacecraft [388e72a1-b851-4b78-9e69-747e06ae215f,826132]);
change note: 2021-07-02 12:53:01.0 [sritz] insert WeightedRelation (id: null related concept uuid: 275efdbc-5d2c-49c1-9e08-c2b50d2ff115 relationship type: null relationship value: null generated by: null);
change note: 2018-12-03 11:20:46.0 [sritz] update WeightedRelation (Platform-Instrument); update WeightedRelation (1);
change note: 2020-09-14 15:16:04.0 [sritz] update Definition (https://www.nasa.gov/mission_pages/station/main/index.html);
change note: 2020-09-14 15:14:01.0 [sritz] insert WeightedRelation (id: null related concept uuid: 3c5cf319-3005-44c3-8b27-3544e862da89 relationship type: null relationship value: null generated by: null);
change note: 2018-12-03 11:20:06.0 [sritz] update Definition (The International Space Station is the largest and most complex international scientific project in history. The station represents a move of unprecedented scale off the home planet. Led by the United States, the International Space Station draws upon the scientific and technological resources of 16 nations: Canada, Japan, Russia, 11 nations of the European Space Agency and Brazil. The goals of the International Space Station are: 1. Find solutions to crucial problems in medicine, ecology and other areas of science. 2. Lay the foundation for developing space-based commerce and enterprise. 3. Create greater worldwide demand for space-related education at all levels by cultivating the excitement, wonder and discovery that the ISS symbolizes. 4. Foster world peace through high-profile, long-term international cooperation in space. [Summary provided by Boeing and NASA] Group: Platform_Details Entry_ID: ISS Group: Platform_Identification Platform_Category: Space Stations/Manned Spacecraft Short_Name: ISS Long_Name: International Space Station End_Group Group: Synonymous_Platform_Names Short_Name: ISS Short_Name: FGB Short_Name: MKS Short_Name: Space Station Short_Name: Unity Short_Name: Zarya Short_Name: 25544 End_Group Group: Platform_Associated_Instruments Short_Name: CATS End_Group Group: Orbit Orbit_Altitude: ~ 350 Km Orbit_Inclination: 51.6° Period: 92.0 minutes Perigee: 384.0 km Apogee: 396.0 km End_Group Creation_Date: 2008-01-30 Online_Resource: https://www.nasa.gov/mission_pages/station/main/index.html Online_Resource: http://en.wikipedia.org/wiki/International_Space_Station Sample_Image: http://www.our-picks.com/wp-content/uploads/2007/06/international-space-station.jpg Group: Platform_Logistics Launch_Date: 1998-11-20 Launch_Site: Baikonur Cosmodrome, Tyuratam, Russia Primary_Sponsor: USA/NASA Primary_Sponsor: Russia/RKA Primary_Sponsor: Canada/CSA Primary_Sponsor: Japan/JAXA Primary_Sponsor: ESA End_Group End_G…
change note: 2021-08-25 16:52:16.0 [sritz] insert WeightedRelation (id: null related concept uuid: f2b0301b-2f33-4048-9381-25a92226ed66 relationship type: null relationship value: null generated by: null);
change note: 2023-06-30 13:19:45.0 [sritz] Move Concepts delete narrower relation (null);
change note: 2022-04-11 15:55:03.0 [sritz] update WeightedRelation (Platform-Instrument); update WeightedRelation (1.0);
change note: 2022-12-01 13:14:16.0 [tstevens] insert WeightedRelation (id: null related concept uuid: 0ef776ed-5347-4dd8-a700-ff77a5ad9a97 relationship type: null relationship value: null generated by: null);
change note: 2021-06-23 15:52:31.0 [sritz] insert WeightedRelation (id: null related concept uuid: 88bd4ce1-adaa-42d8-befa-bd560a9deadf relationship type: null relationship value: null generated by: null);
change note: 2023-03-02 16:36:56.0 [sritz] Insert Concept add narrower relation (ISS [93c5d18c-be62-46c4-9545-42f73a854d85,1222543] - MUSES [cf915b86-38c0-4450-827c-6640c54a555b,1232207]);
change note: 2020-09-14 15:14:33.0 [sritz] update WeightedRelation (Platform-Instrument); update WeightedRelation (1.0);
change note: 2021-11-30 09:56:31.0 [tstevens] Move Concepts delete broader relation (null); add broader relation (ISS [93c5d18c-be62-46c4-9545-42f73a854d85,826516] - Space-based Platforms [b39a69b4-c3b9-4a94-b296-bbbbe5e4c847,835875]);
change note: 2022-04-11 15:54:32.0 [sritz] insert WeightedRelation (id: null related concept uuid: 6ad03566-0766-4e23-bb6c-1a89bf74329b relationship type: null relationship value: null generated by: null);
change note: 2023-06-30 13:20:42.0 [sritz] insert WeightedRelation (id: null related concept uuid: cf915b86-38c0-4450-827c-6640c54a555b relationship type: null relationship value: null generated by: null);
type: Concept
definition: The International Space Station is the largest and most complex international scientific project in history. The station represents a move of unprecedented scale off the home planet. Led by the United States, the International Space Station draws upon the scientific and technological resources of 16 nations: Canada, Japan, Russia, 11 nations of the European Space Agency and Brazil. The goals of the International Space Station are: 1. Find solutions to crucial problems in medicine, ecology and other areas of science. 2. Lay the foundation for developing space-based commerce and enterprise. 3. Create greater worldwide demand for space-related education at all levels by cultivating the excitement, wonder and discovery that the ISS symbolizes. 4. Foster world peace through high-profile, long-term international cooperation in space. [Summary provided by Boeing and NASA] Group: Platform_Details Entry_ID: ISS Group: Platform_Identification Platform_Category: Space Stations/Manned Spacecraft Short_Name: ISS Long_Name: International Space Station End_Group Group: Synonymous_Platform_Names Short_Name: ISS Short_Name: FGB Short_Name: MKS Short_Name: Space Station Short_Name: Unity Short_Name: Zarya Short_Name: 25544 End_Group Group: Platform_Associated_Instruments Short_Name: CATS End_Group Group: Orbit Orbit_Altitude: ~ 350 Km Orbit_Inclination: 51.6° Period: 92.0 minutes Perigee: 384.0 km Apogee: 396.0 km End_Group Creation_Date: 2008-01-30 Online_Resource: https://www.nasa.gov/mission_pages/station/main/index.html Online_Resource: http://en.wikipedia.org/wiki/International_Space_Station Sample_Image: http://www.our-picks.com/wp-content/uploads/2007/06/international-space-station.jpg Group: Platform_Logistics Launch_Date: 1998-11-20 Launch_Site: Baikonur Cosmodrome, Tyuratam, Russia Primary_Sponsor: USA/NASA Primary_Sponsor: Russia/RKA Primary_Sponsor: Canada/CSA Primary_Sponsor: Japan/JAXA Primary_Sponsor: ESA End_Group End_Group
in scheme: platforms
alternative label: INTERNATIONAL SPACE STATION (ISS)