ACADEMIC
type: Concept

UNIBO/DISTART
in scheme: providers
definition: Your university card represents your student status within Bologna University. Welcome! Now you are part of Bologna University where you have an opportunity to grow, think, change... and surf the numerous services which will support you on your chosen study path. Summary provided by: http://www.unibo.it/Portale/default.htm
type: Concept