Subsurface
type: Concept

Yogi
change note: 2021-11-18 09:40:15.0 [tstevens] Move Concepts delete broader relation (null); add broader relation (Yogi [940914db-9ad3-438c-8118-7a0abb0c4a92,826518] - Subsurface [31eb34c8-016e-48c4-9404-7d94ee66cfde,835901]);
change note: 2020-07-24 08:13:29.0 [tstevens] insert Definition (id: null text: Yogi was designed, built, and is operated by the Global Foundation for Ocean Exploration specifically to meet the needs of the science and ocean exploration communities. Its total weight of 1100lbs, relatively small footprint, and significant payload make it an ideal vehicle for a large variety of sensors and sampling equipment. Yogi is capable of collecting spectacular underwater imagery with its high-definition cameras, it carries a 5-function manipulator, and is rated to dive as deep as 1500m. The vehicle’s first project was to explore Yellowstone Lake. language code: en);
change note: 2020-07-24 08:10:58.0 [tstevens] Insert Concept add broader relation (Yogi [940914db-9ad3-438c-8118-7a0abb0c4a92,560556] - ROV [da6420b6-48ec-4ae2-98c7-0ef0538815a0,542741]);
in scheme: platforms
definition: Yogi was designed, built, and is operated by the Global Foundation for Ocean Exploration specifically to meet the needs of the science and ocean exploration communities. Its total weight of 1100lbs, relatively small footprint, and significant payload make it an ideal vehicle for a large variety of sensors and sampling equipment. Yogi is capable of collecting spectacular underwater imagery with its high-definition cameras, it carries a 5-function manipulator, and is rated to dive as deep as 1500m. The vehicle’s first project was to explore Yellowstone Lake.
type: Concept