SHRUBLAND/SCRUB
type: Concept

MONTANE SHRUBLAND
change note: 2016-06-13 12:18:25.0 [gee-cee] insert Definition (id: null text: Pertaining to shrubland found at high elevations. language code: en);
change note: 2016-06-13 12:17:49.0 [gee-cee] Insert Concept add broader relation (MONTANE SHRUBLAND [9409e1f9-f3a9-46fa-aaf9-0e685ca2adcb,188189] - SHRUBLAND/SCRUB [e018b139-7e05-4155-8e2e-8d5603b5fe47,84663]);
in scheme: sciencekeywords
definition: Pertaining to shrubland found at high elevations.
type: Concept