DOI/USGS/GEOG/MCMC/SDTS
in scheme: providers
definition: As an unbiased, multi-disciplinary science organization that focuses on biology, geography, geology, geospatial information, and water, we are dedicated to the timely, relevant, and impartial study of the landscape, our natural resources, and the natural hazards that threaten us. Learn more about our goals and priorities for the coming decade in our Science Strategy.
type: Concept

USGS
type: Concept