DUNES
type: Concept

STAR DUNE
change note: 2013-03-29 10:21:31.0 [tbs1979] insert Definition (id: null text: Radially symmetrical, star dunes are pyramidal sand mounds with slipfaces on three or more arms that radiate from the high center of the mound. They tend to accumulate in areas with multidirectional wind regimes. Star dunes grow upward rather than laterally. They dominate the Grand Erg Oriental of the Sahara. In other deserts, they occur around the margins of the sand seas, particularly near topographic barriers. In the southeast Badain Jaran Desert of China, the star dunes are up to 500 metres tall and may be the tallest dunes on Earth. language code: en);
change note: 2013-02-18 12:29:19.0 [tbs1979] Insert Concept add broader relation (STAR DUNE [94ab11dc-b70b-4705-bb25-c4d430722d28,82587] - DUNES [0c279e58-9ad3-4748-816a-de8cabeaf0c4,82581]);
in scheme: sciencekeywords
definition: Radially symmetrical, star dunes are pyramidal sand mounds with slipfaces on three or more arms that radiate from the high center of the mound. They tend to accumulate in areas with multidirectional wind regimes. Star dunes grow upward rather than laterally. They dominate the Grand Erg Oriental of the Sahara. In other deserts, they occur around the margins of the sand seas, particularly near topographic barriers. In the southeast Badain Jaran Desert of China, the star dunes are up to 500 metres tall and may be the tallest dunes on Earth.
type: Concept