STRATOCUMULUS UNDULATAS
type: Concept

STRATOCUMULUS PERLUCIDUS
change note: 2013-03-21 13:49:51.0 [mpmorahan] insert Definition (id: null text: A cloud variety, usually of the species stratiformis, in which distinct spaces between its elements permit the sun, moon, blue sky, or higher clouds to be seen. These openings may be very small. This variety is found only in the genera altocumulus and stratocumulus. language code: en);
change note: 2013-02-14 10:40:34.0 [mpmorahan] Move Concepts delete broader relation (null); add broader relation (STRATOCUMULUS PERLUCIDUS [94fa2efc-0e7f-4dce-9f2a-0d6f34edcb92,82247] - STRATOCUMULUS UNDULATAS [bec5166e-1822-40f7-8f07-4d5167d8a565,82253]);
change note: 2013-02-14 10:34:37.0 [mpmorahan] Insert Concept add broader relation (STRATOCUMULUS PERLUCIDUS [94fa2efc-0e7f-4dce-9f2a-0d6f34edcb92,82247] - STRATOCUMULUS CUMILIFORMIS [5857260b-1de6-47c2-8f66-5c0dbac42e32,82235]);
in scheme: sciencekeywords
definition: A cloud variety, usually of the species stratiformis, in which distinct spaces between its elements permit the sun, moon, blue sky, or higher clouds to be seen. These openings may be very small. This variety is found only in the genera altocumulus and stratocumulus.
type: Concept