SECCHI DEPTH
in scheme: sciencekeywords
definition: Depth at which a Secchi disk, when lowered into the water from the surface, disappears from view due to turbidity of the water. Used as a quick assessment of water clarity.
type: Concept

OCEAN OPTICS
type: Concept