SULFUR HEXAFLUORIDE PROFILES
change note: 2021-03-03 09:18:29.0 [tstevens] insert Definition (id: null text: A vertical representation of SF6- an inert gas categorized as hydrofluorocarbons. Sulfur hexafluoride absorbs thermal infrared radiation and could increase global warming as its concentration in the atmosphere increases; therefore it is a greenhouse gas. language code: en);
change note: 2021-02-26 13:08:41.0 [tstevens] Insert Concept add broader relation (SULFUR HEXAFLUORIDE PROFILES [958983a1-feee-4139-8a67-b059382e6c06,560884] - SULFUR HEXAFLUORIDE [b4c7dec8-6a9a-4424-8f80-4ad1ed0bc5ec,560883]);
in scheme: sciencekeywords
definition: A vertical representation of SF6- an inert gas categorized as hydrofluorocarbons. Sulfur hexafluoride absorbs thermal infrared radiation and could increase global warming as its concentration in the atmosphere increases; therefore it is a greenhouse gas.
type: Concept

SULFUR HEXAFLUORIDE
type: Concept