UT/DOT
in scheme: providers
definition: The Utah Department of Transportation (UDOT) provides all the necessary transportation needs and information for Utah state citizens. Annually they work to identify strategic goals and focus areas in a plan for the coming year. This plan drives the department's overall performance. This year, UDOT has not only worked to fine tune and evaluate its strategic goals and focus areas, but to make them a focal point for employees and stakeholders. Website: "http://www.dot.state.ut.us/index.php" [Summary provided by UDOT]
type: Concept

UTAH
type: Concept