G - I
type: Concept

IGLO
in scheme: projects
definition: Short Title: IGLO Project URL: http://www.astc.org/iglo/ Proposal URL: http://classic.ipy.org/development/eoi/proposal-details.php?id=455 This proposal is being submitted to the IPY committee by northerners for the benefit of northerners. Being a resident of the arctic, I clearly understand the utter need for practical research that will help to strengthen and improve the health and well-being of community life, and will contribute to making our communities more resilient to the impacts of climate change. At the 2006 World Urban Forum it was acknowledged by global decision-makers that climate change will be one of the key challenges faced by human settlements across the world. The goal of this research node is to build capacity for sustainable community development in Arctic regions so they are less vulnerable, more liveable and stand a better chance of coping with challenges posed by climate change. In the Arctic, building this capacity requires a proactive approach, collaboration amongst a wide range of partners, integration of policies across scales (national, regional, local), accommodation of cultural priorities, and practical application of research. This is reflected in the 2005 Research Needs Survey for Nunavut published by C-CIARN North. It states: The survey results suggest that Nunavut community members recognize considerable overlap among climate change impacts and that they do not generally view climate change adaptation challenges in isolation of other social and environmental pressures. Local climate change pressures need to reflect this holistic perspective, and focus largely on understanding the interactions and cumulative effects of climate change and a host of other factors such as resource development, rapid social change, population growth, health decline, educational achievement, long range contaminant transport, and other factors. Clearly there is a growing need for the practical application of research on the uncertainty, challenges, and impa…
type: Concept