DOI
change note: 2018-03-14 14:45:56.0 [tstevens] insert AltLabel (id: null category: primary text: U.S. Department of the Interior language code: en); insert Definition (id: null text: The Department of the Interior protects and manages the Nation's natural resources and cultural heritage; provides scientific and other information about those resources; and honors its trust responsibilities or special commitments to American Indians, Alaska Natives, and affiliated island communities. The U.S. Department of the Interior is a Cabinet-level agency that manages America's vast natural and cultural resources. The Secretary of the Interior heads our department, which employs 70,000 people, including expert scientists and resource-management professionals, in nine technical bureaus and various offices. The U.S. Department of the Interior protects America's natural resources and heritage, honors our cultures and tribal communities, and supplies the energy to power our future. language code: en); insert Resource (id: null type: provider url: https://www.doi.gov/);
change note: 2018-03-14 14:44:22.0 [tstevens] Insert Concept add broader relation (DOI [97d229ff-6693-4b97-bc16-33ab5c9f1661,310799] - DOI [0111fbd3-e6ec-464a-bc65-2323c2328e7c,280547]);
in scheme: providers
definition: The Department of the Interior protects and manages the Nation's natural resources and cultural heritage; provides scientific and other information about those resources; and honors its trust responsibilities or special commitments to American Indians, Alaska Natives, and affiliated island communities. The U.S. Department of the Interior is a Cabinet-level agency that manages America's vast natural and cultural resources. The Secretary of the Interior heads our department, which employs 70,000 people, including expert scientists and resource-management professionals, in nine technical bureaus and various offices. The U.S. Department of the Interior protects America's natural resources and heritage, honors our cultures and tribal communities, and supplies the energy to power our future.
type: Concept

DOI
type: Concept