CAMEX-1
change note: 2016-06-15 11:44:19.0 [gee-cee] insert Definition (id: null text: The first field campaign in the CAMEX series (CAMEX-1) was conducted from September 8 through October 7, 1993. The AMPR was deployed during CAMEX-1 which was a NASA funded scientific study conducted out of Wallops Flight Facility, VA. This experiment was designed to study the three-dimensional moisture fields using satellite, aircraft, and ground-based instrumentation and the multi-frequency radiometric and lightning signatures of tropical convection in support of the Mission to Planet Earth. The geographic domain of the CAMEX-1 region was between 25.5 degrees north to 43 degrees north latitude and 70 degrees west to 83 degrees west longitude. language code: en);
change note: 2016-06-15 11:43:43.0 [gee-cee] Insert Concept add broader relation (CAMEX-1 [98d21ec8-cea3-446f-aa0e-188604f412c3,188283] - A - C [0c89f3f4-7ab1-43ce-89ee-795d35f0e30a,171937]);
in scheme: projects
definition: The first field campaign in the CAMEX series (CAMEX-1) was conducted from September 8 through October 7, 1993. The AMPR was deployed during CAMEX-1 which was a NASA funded scientific study conducted out of Wallops Flight Facility, VA. This experiment was designed to study the three-dimensional moisture fields using satellite, aircraft, and ground-based instrumentation and the multi-frequency radiometric and lightning signatures of tropical convection in support of the Mission to Planet Earth. The geographic domain of the CAMEX-1 region was between 25.5 degrees north to 43 degrees north latitude and 70 degrees west to 83 degrees west longitude.
type: Concept

A - C
type: Concept