DOI/USGS/GEOG/RMMC
in scheme: providers
definition: The United States Geological Survey Rocky Mountain Mapping Center (USGS/RMMC) which is located in Denver, Colorado conducts mapping activities in the western United States, which include production of digital elevation and planimetric data, production of graphic maps, and development of new mapping techniques. The center also conducts research in environmental sciences, physical sciences, cartography, and geographic information systems. The center maintains the world-wide distribution facility for more than 100,000 different maps, open file reports, and other products of the United States Geological Survey (USGS) and other Federal agencies. Contact Information: U.S. Geological Survey Rocky Mountain Mapping Center Box 25286 Denver, CO 80225 1-888-275-8747 1-888-ASK-USGS infoservices@usgs.gov Website: "http://rockyweb.cr.usgs.gov/" [Summary provided by USGS]
type: Concept

USGS
type: Concept