NON-GOVERNMENT/NON-PROFIT ORGANIZATIONS
type: Concept

RMBO
in scheme: providers
definition: RMBO was founded in 1988 to address a bird conservation and related public education need in the western United States. Our mission is to conserve birds of the Rocky Mountains, Great Plains, and Intermountain West and the habitats on which they depend through research, monitoring, education, and outreach. We accomplish our mission through numerous research and public education programs which have dual goals: to conserve birds and bird habitat, and to increase people's understanding of birds--how they interact with humans, what habitats they use, and what factors threaten their survival. Summary Provided by: http://www.rmbo.org/aboutus/default.aspx
type: Concept