TUNICATES
type: Concept

SEA SQUIRTS
change note: 2017-03-13 14:21:38.0 [mgenazzi] Definition added insert Definition (id: null text: Phylum Chordata. Subphylum Tunicata. Common name for Tunicates, sessile marine invertebrate filter feeders characterized by a tough outer layer of polysaccharide cellulose language code: en);
in scheme: sciencekeywords
definition: Phylum Chordata. Subphylum Tunicata. Common name for Tunicates, sessile marine invertebrate filter feeders characterized by a tough outer layer of polysaccharide cellulose
type: Concept